Applying /builder/shared-workdir/build/sdk/feeds/packages/net/radsecproxy/patches/200-logdest-on-foreground.patch using plaintext: 
patching file radsecproxy.c

Applying /builder/shared-workdir/build/sdk/feeds/packages/net/radsecproxy/patches/300-uninit.patch using plaintext: 
patching file gconfig.c
autoreconf: export WARNINGS=
autoreconf: Entering directory '.'
autoreconf: configure.ac: not using Gettext
autoreconf: running: /builder/shared-workdir/build/sdk/staging_dir/host/bin/aclocal -I /builder/shared-workdir/build/sdk/staging_dir/target-arm_cortex-a8+vfpv3_musl_eabi/host/share/aclocal -I /builder/shared-workdir/build/sdk/staging_dir/hostpkg/share/aclocal -I /builder/shared-workdir/build/sdk/staging_dir/target-arm_cortex-a8+vfpv3_musl_eabi/usr/share/aclocal -I m4 -I . --force 
/builder/shared-workdir/build/sdk/staging_dir/host/bin/aclocal: 2: /builder/shared-workdir/build/sdk/staging_dir/host/bin/aclocal.real: not found
autoreconf: error: /builder/shared-workdir/build/sdk/staging_dir/host/bin/aclocal failed with exit status: 127
configure: WARNING: unrecognized options: --disable-nls
configure: loading site script /builder/shared-workdir/build/sdk/include/site/arm
checking build system type... x86_64-pc-linux-gnu
checking host system type... arm-openwrt-linux-gnu
checking target system type... arm-openwrt-linux-gnu
checking for a BSD-compatible install... /builder/shared-workdir/build/sdk/staging_dir/host/bin/install -c
checking whether build environment is sane... yes
checking for arm-openwrt-linux-strip... arm-openwrt-linux-muslgnueabi-strip
checking for a race-free mkdir -p... /bin/mkdir -p
checking for gawk... gawk
checking whether make sets $(MAKE)... yes
checking whether make supports nested variables... yes
checking for arm-openwrt-linux-gcc... arm-openwrt-linux-muslgnueabi-gcc
checking whether the C compiler works... yes
checking for C compiler default output file name... a.out
checking for suffix of executables... 
checking whether we are cross compiling... yes
checking for suffix of object files... o
checking whether the compiler supports GNU C... yes
checking whether arm-openwrt-linux-muslgnueabi-gcc accepts -g... yes
checking for arm-openwrt-linux-muslgnueabi-gcc option to enable C11 features... none needed
checking whether arm-openwrt-linux-muslgnueabi-gcc understands -c and -o together... yes
checking whether make supports the include directive... yes (GNU style)
checking dependency style of arm-openwrt-linux-muslgnueabi-gcc... none
checking for arm-openwrt-linux-ranlib... arm-openwrt-linux-muslgnueabi-gcc-ranlib
checking for mallopt... no
checking for nettle_sha256_init in -lnettle... yes
UDP transport enabled
TCP transport enabled
TLS (RadSec) transport enabled
DTLS transport enabled
checking for OpenSSL... yes
OpenSSL found in /builder/shared-workdir/build/sdk/staging_dir/target-arm_cortex-a8+vfpv3_musl_eabi/usr
checking that generated files are newer than configure... done
configure: creating ./config.status
config.status: creating radsecproxy.8
config.status: creating radsecproxy.conf.5
config.status: creating Makefile
config.status: creating tests/Makefile
config.status: executing depfiles commands
configure: WARNING: unrecognized options: --disable-nls
make[4]: Entering directory '/builder/shared-workdir/build/sdk/build_dir/target-arm_cortex-a8+vfpv3_musl_eabi/radsecproxy-1.9.1'
CDPATH="${ZSH_VERSION+.}:" && cd . && /bin/bash /builder/shared-workdir/build/sdk/build_dir/target-arm_cortex-a8+vfpv3_musl_eabi/radsecproxy-1.9.1/build-aux/missing aclocal-1.16 
/builder/shared-workdir/build/sdk/staging_dir/host/bin/aclocal-1.16: 2: /builder/shared-workdir/build/sdk/staging_dir/host/bin/aclocal.real: not found
WARNING: 'aclocal-1.16' is missing on your system.
         You should only need it if you modified 'acinclude.m4' or
         'configure.ac' or m4 files included by 'configure.ac'.
         The 'aclocal' program is part of the GNU Automake package:
         <https://www.gnu.org/software/automake>
         It also requires GNU Autoconf, GNU m4 and Perl in order to run:
         <https://www.gnu.org/software/autoconf>
         <https://www.gnu.org/software/m4/>
         <https://www.perl.org/>
make[4]: *** [Makefile:494: aclocal.m4] Error 127
make[4]: Leaving directory '/builder/shared-workdir/build/sdk/build_dir/target-arm_cortex-a8+vfpv3_musl_eabi/radsecproxy-1.9.1'
make[3]: *** [Makefile:60: /builder/shared-workdir/build/sdk/build_dir/target-arm_cortex-a8+vfpv3_musl_eabi/radsecproxy-1.9.1/.built] Error 2
time: package/feeds/packages/radsecproxy/compile#1.38#1.17#4.02