make[4]: Entering directory '/builder/shared-workdir/build/sdk/build_dir/target-arm_cortex-a8+vfpv3_musl_eabi/python-semanage/libsemanage-3.5'
make -C src pywrap
make[5]: Entering directory '/builder/shared-workdir/build/sdk/build_dir/target-arm_cortex-a8+vfpv3_musl_eabi/python-semanage/libsemanage-3.5/src'
arm-openwrt-linux-muslgnueabi-gcc -Os -pipe -fno-caller-saves -fno-plt -fhonour-copts -mfloat-abi=hard -ffile-prefix-map=/builder/shared-workdir/build/sdk/build_dir/target-arm_cortex-a8+vfpv3_musl_eabi/python-semanage/libsemanage-3.5=libsemanage-3.5 -Wformat -Werror=format-security -fstack-protector -D_FORTIFY_SOURCE=1 -Wl,-z,now -Wl,-z,relro -I../include -D_GNU_SOURCE -c -o boolean_record.o boolean_record.c
boolean_record.c:26:10: fatal error: selinux/selinux.h: No such file or directory
   26 | #include <selinux/selinux.h>
      |          ^~~~~~~~~~~~~~~~~~~
compilation terminated.
make[5]: *** [Makefile:111: boolean_record.o] Error 1
make[5]: Leaving directory '/builder/shared-workdir/build/sdk/build_dir/target-arm_cortex-a8+vfpv3_musl_eabi/python-semanage/libsemanage-3.5/src'
make[4]: *** [Makefile:8: pywrap] Error 2
make[4]: Leaving directory '/builder/shared-workdir/build/sdk/build_dir/target-arm_cortex-a8+vfpv3_musl_eabi/python-semanage/libsemanage-3.5'
make[3]: *** [Makefile:66: /builder/shared-workdir/build/sdk/build_dir/target-arm_cortex-a8+vfpv3_musl_eabi/python-semanage/libsemanage-3.5/.built] Error 2
time: package/feeds/packages/python-semanage/compile#0.36#0.20#0.67