Applying /builder/shared-workdir/build/sdk/feeds/packages/utils/bc/patches/001-disable-doc.patch using plaintext: 
patching file Makefile.am
patching file Makefile.in

Applying /builder/shared-workdir/build/sdk/feeds/packages/utils/bc/patches/002-notice-read-and-write-errors-on-input-and-output.patch using plaintext: 
patching file bc/execute.c
patching file bc/main.c
patching file bc/sbc.y
patching file bc/scan.c
patching file bc/scan.l
patching file bc/util.c
patching file dc/dc.c
patching file dc/eval.c
patching file dc/misc.c
patching file dc/numeric.c
patching file dc/stack.c
patching file dc/string.c
patching file h/number.h
patching file lib/number.c

Applying /builder/shared-workdir/build/sdk/feeds/packages/utils/bc/patches/003-dc-fix-exit-code-of-q-command.patch using plaintext: 
patching file dc/eval.c

Applying /builder/shared-workdir/build/sdk/feeds/packages/utils/bc/patches/004-no-gen-libmath.patch using plaintext: 
patching file bc/Makefile.am
patching file bc/libmath.h
autoreconf: export WARNINGS=
autoreconf: Entering directory '.'
autoreconf: configure.ac: not using Gettext
autoreconf: running: /builder/shared-workdir/build/sdk/staging_dir/host/bin/aclocal -I /builder/shared-workdir/build/sdk/staging_dir/target-arm_cortex-a8+vfpv3_musl_eabi/host/share/aclocal -I /builder/shared-workdir/build/sdk/staging_dir/hostpkg/share/aclocal -I /builder/shared-workdir/build/sdk/staging_dir/target-arm_cortex-a8+vfpv3_musl_eabi/usr/share/aclocal -I m4 -I . --force 
/builder/shared-workdir/build/sdk/staging_dir/host/bin/aclocal: 2: /builder/shared-workdir/build/sdk/staging_dir/host/bin/aclocal.real: not found
autoreconf: error: /builder/shared-workdir/build/sdk/staging_dir/host/bin/aclocal failed with exit status: 127
configure: WARNING: unrecognized options: --disable-nls
configure: loading site script /builder/shared-workdir/build/sdk/include/site/arm
checking for a BSD-compatible install... /builder/shared-workdir/build/sdk/staging_dir/host/bin/install -c
checking whether build environment is sane... yes
checking for arm-openwrt-linux-strip... arm-openwrt-linux-muslgnueabi-strip
checking for a thread-safe mkdir -p... /bin/mkdir -p
checking for gawk... gawk
checking whether make sets $(MAKE)... yes
checking whether make supports nested variables... yes
checking for arm-openwrt-linux-gcc... arm-openwrt-linux-muslgnueabi-gcc
checking whether the C compiler works... yes
checking for C compiler default output file name... a.out
checking for suffix of executables... 
checking whether we are cross compiling... yes
checking for suffix of object files... o
checking whether we are using the GNU C compiler... yes
checking whether arm-openwrt-linux-muslgnueabi-gcc accepts -g... yes
checking for arm-openwrt-linux-muslgnueabi-gcc option to accept ISO C89... none needed
checking whether arm-openwrt-linux-muslgnueabi-gcc understands -c and -o together... yes
checking for style of include used by make... GNU
checking dependency style of arm-openwrt-linux-muslgnueabi-gcc... none
checking how to run the C preprocessor... arm-openwrt-linux-muslgnueabi-gcc -E
checking for grep that handles long lines and -e... /builder/shared-workdir/build/sdk/staging_dir/host/bin/grep
checking for egrep... /builder/shared-workdir/build/sdk/staging_dir/host/bin/grep -E
checking for ANSI C header files... yes
checking for sys/types.h... yes
checking for sys/stat.h... yes
checking for stdlib.h... yes
checking for string.h... yes
checking for memory.h... yes
checking for strings.h... yes
checking for inttypes.h... yes
checking for stdint.h... yes
checking for unistd.h... yes
checking minix/config.h usability... no
checking minix/config.h presence... no
checking for minix/config.h... no
checking whether it is safe to define __EXTENSIONS__... yes
checking for flex... flex
checking lex output file root... lex.yy
checking lex library... none needed
checking whether yytext is a pointer... no
checking for arm-openwrt-linux-ar... arm-openwrt-linux-muslgnueabi-gcc-ar
checking the archiver (arm-openwrt-linux-muslgnueabi-gcc-ar) interface... ar
checking for bison... bison -y
checking for arm-openwrt-linux-ranlib... arm-openwrt-linux-muslgnueabi-gcc-ranlib
checking whether make sets $(MAKE)... (cached) yes
checking for stdarg.h... yes
checking for stddef.h... yes
checking for stdlib.h... (cached) yes
checking for string.h... (cached) yes
checking for errno.h... yes
checking for limits.h... yes
checking for unistd.h... (cached) yes
checking for lib.h... no
checking for an ANSI C-conforming const... yes
checking for size_t... yes
checking for ptrdiff_t... yes
checking for vprintf... yes
checking for _doprnt... no
checking for isgraph... yes
checking for setvbuf... yes
checking for fstat... yes
checking for strtol... yes
checking for tparm in -lncurses... yes
checking for readline in -lreadline... yes
checking readline/readline.h usability... yes
checking readline/readline.h presence... yes
checking for readline/readline.h... yes
Using the readline library.
Adding GCC specific compile flags.
checking that generated files are newer than configure... done
configure: creating ./config.status
config.status: creating Makefile
config.status: creating bc/Makefile
config.status: creating dc/Makefile
config.status: creating lib/Makefile
config.status: creating doc/Makefile
config.status: creating doc/texi-ver.incl
config.status: creating config.h
config.status: executing depfiles commands
configure: WARNING: unrecognized options: --disable-nls
make[4]: Entering directory '/builder/shared-workdir/build/sdk/build_dir/target-arm_cortex-a8+vfpv3_musl_eabi/bc-1.07.1'
CDPATH="${ZSH_VERSION+.}:" && cd . && /bin/bash /builder/shared-workdir/build/sdk/build_dir/target-arm_cortex-a8+vfpv3_musl_eabi/bc-1.07.1/missing aclocal-1.14 
/builder/shared-workdir/build/sdk/staging_dir/host/bin/aclocal-1.14: 2: /builder/shared-workdir/build/sdk/staging_dir/host/bin/aclocal.real: not found
WARNING: 'aclocal-1.14' is missing on your system.
         You should only need it if you modified 'acinclude.m4' or
         'configure.ac' or m4 files included by 'configure.ac'.
         The 'aclocal' program is part of the GNU Automake package:
         <http://www.gnu.org/software/automake>
         It also requires GNU Autoconf, GNU m4 and Perl in order to run:
         <http://www.gnu.org/software/autoconf>
         <http://www.gnu.org/software/m4/>
         <http://www.perl.org/>
make[4]: *** [Makefile:332: aclocal.m4] Error 127
make[4]: Leaving directory '/builder/shared-workdir/build/sdk/build_dir/target-arm_cortex-a8+vfpv3_musl_eabi/bc-1.07.1'
make[3]: *** [Makefile:69: /builder/shared-workdir/build/sdk/build_dir/target-arm_cortex-a8+vfpv3_musl_eabi/bc-1.07.1/.built] Error 2
time: package/feeds/packages/bc/compile#3.73#2.59#10.35