autoreconf: export WARNINGS=
autoreconf: Entering directory '.'
autoreconf: configure.ac: not using Gettext
autoreconf: running: /builder/shared-workdir/build/sdk/staging_dir/host/bin/aclocal -I /builder/shared-workdir/build/sdk/staging_dir/target-arm_arm1176jzf-s+vfp_musl_eabi/host/share/aclocal -I /builder/shared-workdir/build/sdk/staging_dir/hostpkg/share/aclocal -I /builder/shared-workdir/build/sdk/staging_dir/target-arm_arm1176jzf-s+vfp_musl_eabi/usr/share/aclocal -I m4 -I . --force 
/builder/shared-workdir/build/sdk/staging_dir/host/bin/aclocal: 2: /builder/shared-workdir/build/sdk/staging_dir/host/bin/aclocal.real: not found
autoreconf: error: /builder/shared-workdir/build/sdk/staging_dir/host/bin/aclocal failed with exit status: 127
configure: loading site script /builder/shared-workdir/build/sdk/include/site/arm
checking for a BSD-compatible install... /builder/shared-workdir/build/sdk/staging_dir/host/bin/install -c
checking whether build environment is sane... yes
checking for arm-openwrt-linux-strip... arm-openwrt-linux-muslgnueabi-strip
checking for a race-free mkdir -p... /bin/mkdir -p
checking for gawk... gawk
checking whether make sets $(MAKE)... yes
checking whether make supports nested variables... yes
checking whether make supports nested variables... (cached) yes
checking whether make supports the include directive... yes (GNU style)
checking for arm-openwrt-linux-gcc... arm-openwrt-linux-muslgnueabi-gcc
checking whether the C compiler works... yes
checking for C compiler default output file name... a.out
checking for suffix of executables... 
checking whether we are cross compiling... yes
checking for suffix of object files... o
checking whether the compiler supports GNU C... yes
checking whether arm-openwrt-linux-muslgnueabi-gcc accepts -g... yes
checking for arm-openwrt-linux-muslgnueabi-gcc option to enable C11 features... none needed
checking whether arm-openwrt-linux-muslgnueabi-gcc understands -c and -o together... yes
checking dependency style of arm-openwrt-linux-muslgnueabi-gcc... none
checking for stdio.h... yes
checking for stdlib.h... yes
checking for string.h... yes
checking for inttypes.h... yes
checking for stdint.h... yes
checking for strings.h... yes
checking for sys/stat.h... yes
checking for sys/types.h... yes
checking for unistd.h... yes
checking for wchar.h... yes
checking for minix/config.h... no
checking whether it is safe to define __EXTENSIONS__... yes
checking whether _XOPEN_SOURCE should be defined... no
checking for special C compiler options needed for large files... no
checking for _FILE_OFFSET_BITS value needed for large files... no
checking for byteswap.h... yes
checking for nl_langinfo... yes
checking for iconv... yes
checking pkg-config is at least version 0.9.0... yes
checking for LIBUSB... yes
checking for UDEV... yes
checking that generated files are newer than configure... done
configure: creating ./config.status
config.status: creating usbutils.pc
config.status: WARNING:  'usbutils.pc.in' seems to ignore the --datarootdir setting
config.status: creating Makefile
config.status: creating config.h
config.status: executing depfiles commands
=== configuring in usbhid-dump (/builder/shared-workdir/build/sdk/build_dir/target-arm_arm1176jzf-s+vfp_musl_eabi/usbutils-017/usbhid-dump)
configure: running /bin/bash ./configure --disable-option-checking '--prefix=/usr'  '--target=arm-openwrt-linux' '--host=arm-openwrt-linux' '--build=x86_64-pc-linux-gnu' '--disable-dependency-tracking' '--program-prefix=' '--program-suffix=' '--exec-prefix=/usr' '--bindir=/usr/bin' '--sbindir=/usr/sbin' '--libexecdir=/usr/lib' '--sysconfdir=/etc' '--datadir=/usr/share' '--localstatedir=/var' '--mandir=/usr/man' '--infodir=/usr/info' '--disable-nls' '--datadir=/usr/share/hwdata' 'build_alias=x86_64-pc-linux-gnu' 'host_alias=arm-openwrt-linux' 'target_alias=arm-openwrt-linux' 'CC=arm-openwrt-linux-muslgnueabi-gcc' 'CFLAGS=-Os -pipe -fno-caller-saves -fno-plt -fhonour-copts -mfloat-abi=hard -ffile-prefix-map=/builder/shared-workdir/build/sdk/build_dir/target-arm_arm1176jzf-s+vfp_musl_eabi/usbutils-017=usbutils-017 -Wformat -Werror=format-security -fstack-protector -D_FORTIFY_SOURCE=1 -Wl,-z,now -Wl,-z,relro ' 'LDFLAGS=-L/builder/shared-workdir/build/sdk/staging_dir/toolchain-arm_arm1176jzf-s+vfp_gcc-13.3.0_musl_eabi/usr/lib -L/builder/shared-workdir/build/sdk/staging_dir/toolchain-arm_arm1176jzf-s+vfp_gcc-13.3.0_musl_eabi/lib -fuse-ld=bfd -znow -zrelro ' 'CPPFLAGS=-I/builder/shared-workdir/build/sdk/staging_dir/toolchain-arm_arm1176jzf-s+vfp_gcc-13.3.0_musl_eabi/usr/include -I/builder/shared-workdir/build/sdk/staging_dir/toolchain-arm_arm1176jzf-s+vfp_gcc-13.3.0_musl_eabi/include -I/builder/shared-workdir/build/sdk/staging_dir/toolchain-arm_arm1176jzf-s+vfp_gcc-13.3.0_musl_eabi/include/fortify ' 'PKG_CONFIG=/builder/shared-workdir/build/sdk/staging_dir/host/bin/pkg-config' 'PKG_CONFIG_PATH=/builder/shared-workdir/build/sdk/staging_dir/target-arm_arm1176jzf-s+vfp_musl_eabi/usr/lib/pkgconfig:/builder/shared-workdir/build/sdk/staging_dir/target-arm_arm1176jzf-s+vfp_musl_eabi/usr/share/pkgconfig' 'PKG_CONFIG_LIBDIR=/builder/shared-workdir/build/sdk/staging_dir/target-arm_arm1176jzf-s+vfp_musl_eabi/usr/lib/pkgconfig:/builder/shared-workdir/build/sdk/staging_dir/target-arm_arm1176jzf-s+vfp_musl_eabi/usr/share/pkgconfig' --cache-file=/dev/null --srcdir=.
configure: loading site script /builder/shared-workdir/build/sdk/include/site/arm
checking for a BSD-compatible install... /builder/shared-workdir/build/sdk/staging_dir/host/bin/install -c
checking whether build environment is sane... yes
checking for arm-openwrt-linux-strip... arm-openwrt-linux-muslgnueabi-strip
checking for a race-free mkdir -p... /bin/mkdir -p
checking for gawk... gawk
checking whether make sets $(MAKE)... yes
checking whether make supports nested variables... yes
checking whether make supports nested variables... (cached) yes
checking whether to enable maintainer-specific portions of Makefiles... no
checking whether make supports the include directive... yes (GNU style)
checking for arm-openwrt-linux-gcc... arm-openwrt-linux-muslgnueabi-gcc
checking whether the C compiler works... yes
checking for C compiler default output file name... a.out
checking for suffix of executables... 
checking whether we are cross compiling... yes
checking for suffix of object files... o
checking whether the compiler supports GNU C... yes
checking whether arm-openwrt-linux-muslgnueabi-gcc accepts -g... yes
checking for arm-openwrt-linux-muslgnueabi-gcc option to enable C11 features... none needed
checking whether arm-openwrt-linux-muslgnueabi-gcc understands -c and -o together... yes
checking dependency style of arm-openwrt-linux-muslgnueabi-gcc... none
checking for stdio.h... yes
checking for stdlib.h... yes
checking for string.h... yes
checking for inttypes.h... yes
checking for stdint.h... yes
checking for strings.h... yes
checking for sys/stat.h... yes
checking for sys/types.h... yes
checking for unistd.h... yes
checking for wchar.h... yes
checking for minix/config.h... no
checking whether it is safe to define __EXTENSIONS__... yes
checking whether _XOPEN_SOURCE should be defined... no
checking pkg-config is at least version 0.9.0... yes
checking for LIBUSB... yes
checking for libusb_set_option... yes
checking that generated files are newer than configure... done
configure: creating ./config.status
config.status: creating Makefile
config.status: creating src/Makefile
config.status: creating config.h
config.status: executing depfiles commands

	usbutils 017
	=============

	prefix:                 /usr
	datarootdir:            ${prefix}/share
	datadir:                /usr/share/hwdata
	pkgconfigdir:		${libdir}/pkgconfig
	mandir:                 /usr/man

	usb.ids:                /usr/share/hwdata/usb.ids

	compiler:               arm-openwrt-linux-muslgnueabi-gcc
	cflags:                 -Os -pipe -fno-caller-saves -fno-plt -fhonour-copts -mfloat-abi=hard -ffile-prefix-map=/builder/shared-workdir/build/sdk/build_dir/target-arm_arm1176jzf-s+vfp_musl_eabi/usbutils-017=usbutils-017 -Wformat -Werror=format-security -fstack-protector -D_FORTIFY_SOURCE=1 -Wl,-z,now -Wl,-z,relro 
	ldflags:                -L/builder/shared-workdir/build/sdk/staging_dir/toolchain-arm_arm1176jzf-s+vfp_gcc-13.3.0_musl_eabi/usr/lib -L/builder/shared-workdir/build/sdk/staging_dir/toolchain-arm_arm1176jzf-s+vfp_gcc-13.3.0_musl_eabi/lib -fuse-ld=bfd -znow -zrelro 

make[4]: Entering directory '/builder/shared-workdir/build/sdk/build_dir/target-arm_arm1176jzf-s+vfp_musl_eabi/usbutils-017'
CDPATH="${ZSH_VERSION+.}:" && cd . && /bin/bash '/builder/shared-workdir/build/sdk/build_dir/target-arm_arm1176jzf-s+vfp_musl_eabi/usbutils-017/missing' aclocal-1.16 
/builder/shared-workdir/build/sdk/staging_dir/host/bin/aclocal-1.16: 2: /builder/shared-workdir/build/sdk/staging_dir/host/bin/aclocal.real: not found
WARNING: 'aclocal-1.16' is missing on your system.
         You should only need it if you modified 'acinclude.m4' or
         'configure.ac' or m4 files included by 'configure.ac'.
         The 'aclocal' program is part of the GNU Automake package:
         <https://www.gnu.org/software/automake>
         It also requires GNU Autoconf, GNU m4 and Perl in order to run:
         <https://www.gnu.org/software/autoconf>
         <https://www.gnu.org/software/m4/>
         <https://www.perl.org/>
make[4]: *** [Makefile:474: aclocal.m4] Error 127
make[4]: Leaving directory '/builder/shared-workdir/build/sdk/build_dir/target-arm_arm1176jzf-s+vfp_musl_eabi/usbutils-017'
make[3]: *** [Makefile:48: /builder/shared-workdir/build/sdk/build_dir/target-arm_arm1176jzf-s+vfp_musl_eabi/usbutils-017/.built] Error 2
time: package/feeds/packages/usbutils/compile#3.72#1.89#7.60