Applying /builder/shared-workdir/build/sdk/feeds/packages/utils/podman/patches/010-do-not-build-docs.patch using plaintext: 
patching file Makefile
make[4]: Entering directory '/builder/shared-workdir/build/sdk/build_dir/target-arm_arm1176jzf-s+vfp_musl_eabi/podman-5.2.2'
fatal: not a git repository (or any of the parent directories): .git
Podman is being compiled without the systemd build tag. 	Install libsystemd on Ubuntu or systemd-devel on rpm based 	distro for journald support.
CGO_ENABLED=1 GOOS=linux GOARCH=arm go build \
	 \
	-ldflags ' -X github.com/containers/podman/v5/libpod/define.buildInfo=1740353421 -X github.com/containers/podman/v5/libpod/config._installPrefix=/usr -X github.com/containers/podman/v5/libpod/config._etcDir=/etc -X github.com/containers/podman/v5/pkg/systemd/quadlet._binDir=/usr/bin -X github.com/containers/common/pkg/config.additionalHelperBinariesDir= ' \
	-tags "seccomp exclude_graphdriver_devicemapper apparmor " \
	-o bin/podman ./cmd/podman
mkdir -p bin
fatal: not a git repository (or any of the parent directories): .git
CGO_ENABLED=1 GOOS=linux GOARCH=arm go build \
	 \
	-ldflags ' -X github.com/containers/podman/v5/libpod/define.buildInfo=1740353421 -X github.com/containers/podman/v5/libpod/config._installPrefix=/usr -X github.com/containers/podman/v5/libpod/config._etcDir=/etc -X github.com/containers/podman/v5/pkg/systemd/quadlet._binDir=/usr/bin -X github.com/containers/common/pkg/config.additionalHelperBinariesDir= ' \
	-tags "seccomp exclude_graphdriver_devicemapper apparmor " \
	-o bin/podman-testing ./cmd/podman-testing
# github.com/seccomp/libseccomp-golang
# [/builder/shared-workdir/build/sdk/staging_dir/host/bin/pkg-config --cflags  -- libseccomp]
Package libseccomp was not found in the pkg-config search path.
Perhaps you should add the directory containing `libseccomp.pc'
to the PKG_CONFIG_PATH environment variable
Package 'libseccomp' not found
# github.com/seccomp/libseccomp-golang
# [/builder/shared-workdir/build/sdk/staging_dir/host/bin/pkg-config --cflags  -- libseccomp]
Package libseccomp was not found in the pkg-config search path.
Perhaps you should add the directory containing `libseccomp.pc'
to the PKG_CONFIG_PATH environment variable
Package 'libseccomp' not found
make[4]: *** [Makefile:467: bin/podman-testing] Error 1
make[4]: *** Waiting for unfinished jobs....
make[4]: *** [Makefile:377: bin/podman] Error 1
make[4]: Leaving directory '/builder/shared-workdir/build/sdk/build_dir/target-arm_arm1176jzf-s+vfp_musl_eabi/podman-5.2.2'
make[3]: *** [Makefile:116: /builder/shared-workdir/build/sdk/build_dir/target-arm_arm1176jzf-s+vfp_musl_eabi/podman-5.2.2/.built] Error 2
time: package/feeds/packages/podman/compile#474.83#42.29#105.43