Applying /builder/shared-workdir/build/sdk/feeds/packages/net/hs20/patches/010-libxml-212.patch using plaintext: 
patching file src/utils/xml_libxml2.c

Applying /builder/shared-workdir/build/sdk/feeds/packages/net/hs20/patches/050-use-dm_ddf-v1_3_dtd.patch using plaintext: 
patching file hs20/server/spp_server.c

Applying /builder/shared-workdir/build/sdk/feeds/packages/net/hs20/patches/100-fix-hs20_spp_server-path.patch using plaintext: 
patching file hs20/server/www/spp.php

Applying /builder/shared-workdir/build/sdk/feeds/packages/net/hs20/patches/200-adapt-config-php.patch using plaintext: 
patching file hs20/server/www/config.php

Applying /builder/shared-workdir/build/sdk/feeds/packages/net/hs20/patches/300-paths-in-ca-setup-sh.patch using plaintext: 
patching file hs20/server/ca/setup.sh
make[4]: warning: jobserver unavailable: using -j1.  Add '+' to parent make rule.
make[4]: Entering directory '/builder/shared-workdir/build/sdk/build_dir/target-arm_arm1176jzf-s+vfp_musl_eabi/hs20/hostapd-2020-06-08-5a8b3662/hostapd'
In file included from main.c:25:
/builder/shared-workdir/build/sdk/build_dir/target-arm_arm1176jzf-s+vfp_musl_eabi/hs20/hostapd-2020-06-08-5a8b3662/src/ap/hostapd.h:13:10: fatal error: sqlite3.h: No such file or directory
   13 | #include <sqlite3.h>
      |          ^~~~~~~~~~~
compilation terminated.
make[4]: *** [Makefile:1288: main.o] Error 1
make[4]: Leaving directory '/builder/shared-workdir/build/sdk/build_dir/target-arm_arm1176jzf-s+vfp_musl_eabi/hs20/hostapd-2020-06-08-5a8b3662/hostapd'
make[3]: *** [Makefile:150: /builder/shared-workdir/build/sdk/build_dir/target-arm_arm1176jzf-s+vfp_musl_eabi/hs20/hostapd-2020-06-08-5a8b3662/.built] Error 2
time: package/feeds/packages/hs20/compile#0.81#0.51#1.34