Applying /builder/shared-workdir/build/sdk/feeds/packages/libs/apr-util/patches/004-avoid_ldap_by_defaut.patch using plaintext: 
patching file apu-config.in

Applying /builder/shared-workdir/build/sdk/feeds/packages/libs/apr-util/patches/005-apu_config_dont_list_indep_libs.patch using plaintext: 
patching file apr-util.pc.in
patching file apu-config.in

Applying /builder/shared-workdir/build/sdk/feeds/packages/libs/apr-util/patches/006-avoid_db_by-default.patch using plaintext: 
patching file apu-config.in
autoreconf: export WARNINGS=
autoreconf: warning: autoconf input should be named 'configure.ac', not 'configure.in'
autoreconf: Entering directory '.'
autoreconf: configure.in: not using Gettext
autoreconf: running: /builder/shared-workdir/build/sdk/staging_dir/host/bin/aclocal -I /builder/shared-workdir/build/sdk/staging_dir/target-arm_arm1176jzf-s+vfp_musl_eabi/host/share/aclocal -I /builder/shared-workdir/build/sdk/staging_dir/hostpkg/share/aclocal -I /builder/shared-workdir/build/sdk/staging_dir/target-arm_arm1176jzf-s+vfp_musl_eabi/usr/share/aclocal -I m4 -I . --force 
/builder/shared-workdir/build/sdk/staging_dir/host/bin/aclocal: 2: /builder/shared-workdir/build/sdk/staging_dir/host/bin/aclocal.real: not found
autoreconf: error: /builder/shared-workdir/build/sdk/staging_dir/host/bin/aclocal failed with exit status: 127
configure: WARNING: unrecognized options: --disable-dependency-tracking, --disable-nls
configure: loading site script /builder/shared-workdir/build/sdk/include/site/arm
checking build system type... x86_64-pc-linux-gnu
checking host system type... arm-openwrt-linux-gnu
checking target system type... arm-openwrt-linux-gnu
checking for a BSD-compatible install... /builder/shared-workdir/build/sdk/staging_dir/host/bin/install -c
checking for working mkdir -p... yes
APR-util Version: 1.6.3
checking for chosen layout... apr-util
checking for arm-openwrt-linux-gcc... arm-openwrt-linux-muslgnueabi-gcc
checking whether the C compiler works... yes
checking for C compiler default output file name... a.out
checking for suffix of executables... 
checking whether we are cross compiling... yes
checking for suffix of object files... o
checking whether the compiler supports GNU C... yes
checking whether arm-openwrt-linux-muslgnueabi-gcc accepts -g... yes
checking for arm-openwrt-linux-muslgnueabi-gcc option to enable C11 features... none needed
Applying apr-util hints file rules for arm-openwrt-linux-gnu
checking for APR... yes
  setting CPP to "arm-openwrt-linux-muslgnueabi-gcc -E"
  adding "-DLINUX" to CPPFLAGS
  adding "-D_REENTRANT" to CPPFLAGS
  adding "-D_GNU_SOURCE" to CPPFLAGS
checking for stdio.h... yes
checking for stdlib.h... yes
checking for string.h... yes
checking for inttypes.h... yes
checking for stdint.h... yes
checking for strings.h... yes
checking for sys/stat.h... yes
checking for sys/types.h... yes
checking for unistd.h... yes
checking for arm-openwrt-linux-muslgnueabi-gcc options needed to detect all undeclared functions... none needed
  adding "-I/builder/shared-workdir/build/sdk/staging_dir/target-arm_arm1176jzf-s+vfp_musl_eabi/usr/include" to CPPFLAGS
  adding "-L/builder/shared-workdir/build/sdk/staging_dir/target-arm_arm1176jzf-s+vfp_musl_eabi/usr/lib" to LDFLAGS
configure: checking for openssl in /builder/shared-workdir/build/sdk/staging_dir/target-arm_arm1176jzf-s+vfp_musl_eabi/usr
checking for openssl/x509.h... yes
checking for EVP_CIPHER_CTX_new in -lcrypto... yes
checking for SSL_accept in -lssl... yes
  setting APRUTIL_LDFLAGS to "-L/builder/shared-workdir/build/sdk/staging_dir/target-arm_arm1176jzf-s+vfp_musl_eabi/usr/lib"
  setting APRUTIL_INCLUDES to "-I/builder/shared-workdir/build/sdk/staging_dir/target-arm_arm1176jzf-s+vfp_musl_eabi/usr/include"
checking whether EVP_PKEY_CTX_new is declared... yes
  setting LDADD_crypto_openssl to "-L/builder/shared-workdir/build/sdk/staging_dir/target-arm_arm1176jzf-s+vfp_musl_eabi/usr/lib  -lssl -lcrypto"
checking for const input buffers in OpenSSL... no
checking how to run the C preprocessor... arm-openwrt-linux-muslgnueabi-gcc -E
checking for grep that handles long lines and -e... /builder/shared-workdir/build/sdk/staging_dir/host/bin/grep
checking for egrep... /builder/shared-workdir/build/sdk/staging_dir/host/bin/grep -E
checking for ldap support...
checking for ldap_init in -lldap50... no
checking for ldap_init in -lldapssl41... no
checking for ldap_init in -lldapssl40... no
checking for ldap_init in -lldapssl30... no
checking for ldap_init in -lldapssl20... no
checking for ldap_init in -lldapsdk... no
checking for ldap_init in -lldapsdk... no
checking for ldap_init in -lldap... no
checking for ldap_init in -lldap... no
checking for ldap_init in -lldap... no
checking for ldap_init in -lldap... no
configure: error: could not find an LDAP library
make[3]: *** [Makefile:170: /builder/shared-workdir/build/sdk/build_dir/target-arm_arm1176jzf-s+vfp_musl_eabi/apr-util-1.6.3/.configured_62e76c8bb3ec02aa58ec7ed71fe96025] Error 1
time: package/feeds/packages/apr-util/compile#3.25#1.65#6.16